Fixup test020

Remove dependency on number of fields in debug output
3 jobs for logthr in 15 minutes and 38 seconds (queued for 3 minutes and 24 seconds)
Status Job ID Name Coverage
  Build
failed #5732
build-gnutls-mit-standalone-lloadd

00:06:36

passed #5730
build-no-threads-no-slapd

00:03:17

failed #5731
build-openssl-heimdal-lloadd

00:05:44

 
Name Stage Failure
failed
build-gnutls-mit-standalone-lloadd Build
make[1]: *** [Makefile:282: test] Error 2
make[1]: Leaving directory '/builds/hyc/openldap/tests'
make: *** [Makefile:294: test] Error 2
Uploading artifacts for failed job
Uploading artifacts...
tests/testrun/: found 7 matching files and directories

Uploading artifacts as "archive" to coordinator... ok
id=5732 responseStatus=201 Created token=_unEg-NB
Cleaning up file based variables
ERROR: Job failed: exit code 1
failed
build-openssl-heimdal-lloadd Build
make[2]: Leaving directory '/builds/hyc/openldap/tests'
make: *** [Makefile:294: test] Error 2
make[1]: Leaving directory '/builds/hyc/openldap/tests'
Uploading artifacts for failed job
Uploading artifacts...
tests/testrun/: found 7 matching files and directories

Uploading artifacts as "archive" to coordinator... ok
id=5731 responseStatus=201 Created token=8CyCQZyD
Cleaning up file based variables
ERROR: Job failed: exit code 1