Force a core dump in test000

3 jobs for artifacts in 10 minutes and 32 seconds (queued for 1 second)
Status Job ID Name Coverage
  Build
failed #6178
build-gnutls-mit-standalone-lloadd

00:10:25

passed #6176
build-no-threads-no-slapd

00:04:03

failed #6177
build-openssl-heimdal-lloadd

00:10:32

 
Name Stage Failure
failed
build-openssl-heimdal-lloadd Build
make[1]: Leaving directory '/builds/hyc/openldap/obj/tests'
make: *** [Makefile:297: test] Error 2
Uploading artifacts for failed job
Uploading artifacts...
obj/tests/testrun/: found 8 matching files and directories

obj/servers/lloadd/: found 42 matching files and directories

Uploading artifacts as "archive" to coordinator... ok
id=6177 responseStatus=201 Created token=EKYC2rzs
Cleaning up file based variables
ERROR: Job failed: exit code 1
failed
build-gnutls-mit-standalone-lloadd Build
make[1]: *** [Makefile:285: test] Error 2
make: *** [Makefile:297: test] Error 2
Uploading artifacts for failed job
Uploading artifacts...
obj/tests/testrun/: found 8 matching files and directories

obj/servers/slapd/: found 804 matching files and directories

Uploading artifacts as "archive" to coordinator... ok
id=6178 responseStatus=201 Created token=8ctrRHnh
Cleaning up file based variables
ERROR: Job failed: exit code 1