add client name to stats buffer, and update build to use stats.c

3 jobs for !346 with stats in 5 minutes and 33 seconds (queued for 4 seconds)
latest detached
Status Name Job ID Coverage
  Build
failed build-gnutls-mit-standalone-lloadd #7302

00:05:21

failed build-no-threads-no-slapd #7300

00:02:45

failed build-openssl-heimdal-lloadd #7301

00:05:33

 
Name Stage Failure
failed
build-gnutls-mit-standalone-lloadd Build
make[1]: Leaving directory '/builds/jklowden/openldap/obj/tests'
make: *** [Makefile:321: all-common] Error 1
Uploading artifacts for failed job
Uploading artifacts...
WARNING: obj/tests/testrun/: no matching files
obj/servers/: found 832 matching files and directories

Uploading artifacts as "archive" to coordinator... ok
id=7302 responseStatus=201 Created token=DTQg6Psx
Cleaning up file based variables
ERROR: Job failed: exit code 1
failed
build-openssl-heimdal-lloadd Build
make[1]: *** [Makefile:368: all-common] Error 1
make: *** [Makefile:321: all-common] Error 1
Uploading artifacts for failed job
Uploading artifacts...
WARNING: obj/tests/testrun/: no matching files
obj/servers/: found 857 matching files and directories

Uploading artifacts as "archive" to coordinator... ok
id=7301 responseStatus=201 Created token=8QnFaE9z
Cleaning up file based variables
ERROR: Job failed: exit code 1
failed
build-no-threads-no-slapd Build
          ^~~~~~~~~~~~~~
compilation terminated.
make[2]: *** [<builtin>: stats.o] Error 1
make[2]: Leaving directory '/builds/jklowden/openldap/tests/progs'
make[1]: *** [Makefile:368: all-common] Error 1
make[1]: Leaving directory '/builds/jklowden/openldap/tests'
make: *** [Makefile:321: all-common] Error 1
Cleaning up file based variables
ERROR: Job failed: exit code 1