ITS#9347 Retry with default if specified one is invalid/missing

3 jobs for its9347 in 8 minutes and 56 seconds (queued for 1 second)
Status Job ID Name Coverage
  Build
failed #4034
build-gnutls-mit-standalone-lloadd

00:08:47

passed #4032
build-no-threads-no-slapd

00:02:34

failed #4033
build-openssl-heimdal-lloadd

00:08:55

 
Name Stage Failure
failed
build-openssl-heimdal-lloadd Build
make[1]: *** [Makefile:284: test] Error 2
make[1]: Leaving directory '/builds/ondra/openldap/tests'
make: *** [Makefile:296: test] Error 2
Uploading artifacts for failed job
Uploading artifacts...
tests/testrun/: found 10 matching files and directories

Uploading artifacts as "archive" to coordinator... ok
id=4033 responseStatus=201 Created token=KQAPP4su
Cleaning up file based variables
ERROR: Job failed: exit code 1
failed
build-gnutls-mit-standalone-lloadd Build
make[1]: *** [Makefile:284: test] Error 2
make[1]: Leaving directory '/builds/ondra/openldap/tests'
make: *** [Makefile:296: test] Error 2
Uploading artifacts for failed job
Uploading artifacts...
tests/testrun/: found 10 matching files and directories

Uploading artifacts as "archive" to coordinator... ok
id=4034 responseStatus=201 Created token=KiZDcugy
Cleaning up file based variables
ERROR: Job failed: exit code 1