Test silent delta-sync conflicts

3 jobs for delta-conflicts in 26 minutes and 18 seconds (queued for 1 second)
latest
Status Job ID Name Coverage
  Build
failed #1767
build-gnutls-mit

00:26:06

passed #1765
build-no-threads-no-slapd

00:02:57

failed #1766
build-openssl-heimdal

00:26:18

 
Name Stage Failure
failed
build-openssl-heimdal Build
make[2]: Leaving directory '/builds/ondra/openldap/tests'
make[1]: Leaving directory '/builds/ondra/openldap/tests'
make[1]: *** [Makefile:277: test] Error 2
make: *** [Makefile:291: test] Error 2
Uploading artifacts for failed job
Uploading artifacts...
tests/testrun/: found 67 matching files and directories

Uploading artifacts as "archive" to coordinator... ok
id=1766 responseStatus=201 Created token=KzgSmSdf
ERROR: Job failed: exit code 1
failed
build-gnutls-mit Build
make[2]: Leaving directory '/builds/ondra/openldap/tests'
make[1]: *** [Makefile:277: test] Error 2
make[1]: Leaving directory '/builds/ondra/openldap/tests'
make: *** [Makefile:291: test] Error 2
Uploading artifacts for failed job
Uploading artifacts...
tests/testrun/: found 67 matching files and directories

Uploading artifacts as "archive" to coordinator... ok
id=1767 responseStatus=201 Created token=zbtRqqbv
ERROR: Job failed: exit code 1