ITS#9341 Prefix sync operation in logs

3 jobs for !145 with delta-conflicts in 24 minutes and 20 seconds (queued for 1 second)
latest detached
Status Name Job ID Coverage
  Build
failed build-gnutls-mit-standalone-lloadd #2950

00:19:55

passed build-no-threads-no-slapd #2948

00:04:16

failed build-openssl-heimdal-lloadd #2949

00:20:03

 
Name Stage Failure
failed
build-gnutls-mit-standalone-lloadd Build
make[1]: *** [Makefile:284: test] Error 2
make[1]: Leaving directory '/builds/openldap/openldap/tests'
make: *** [Makefile:296: test] Error 2
Uploading artifacts for failed job
Uploading artifacts...
tests/testrun/: found 23 matching files and directories

Uploading artifacts as "archive" to coordinator... ok
id=2950 responseStatus=201 Created token=YaxgnTCz
Cleaning up file based variables
ERROR: Job failed: exit code 1
failed
build-openssl-heimdal-lloadd Build
make[1]: *** [Makefile:284: test] Error 2
make[1]: Leaving directory '/builds/openldap/openldap/tests'
make: *** [Makefile:296: test] Error 2
Uploading artifacts for failed job
Uploading artifacts...
tests/testrun/: found 23 matching files and directories

Uploading artifacts as "archive" to coordinator... ok
id=2949 responseStatus=201 Created token=yCyBd9qd
Cleaning up file based variables
ERROR: Job failed: exit code 1