Another symbol versioning fix

3 jobs for its9673 in 2 minutes and 48 seconds (queued for 6 seconds)
Name Stage Failure
failed
build-openssl-heimdal-lloadd Build
make[1]: Leaving directory '/builds/quanah/openldap/obj/libraries'
make: *** [Makefile:320: all-common] Error 1
Uploading artifacts for failed job
Uploading artifacts...
WARNING: obj/tests/testrun/: no matching files
obj/servers/: found 44 matching files and directories

Uploading artifacts as "archive" to coordinator... ok
id=9715 responseStatus=201 Created token=dsNJwQ3L
Cleaning up project directory and file based variables
ERROR: Job failed: exit code 1

failed
build-gnutls-mit-standalone-lloadd Build
make[1]: Leaving directory '/builds/quanah/openldap/obj/libraries'
make: *** [Makefile:320: all-common] Error 1
Uploading artifacts for failed job
Uploading artifacts...
WARNING: obj/tests/testrun/: no matching files
obj/servers/: found 44 matching files and directories

Uploading artifacts as "archive" to coordinator... ok
id=9716 responseStatus=201 Created token=XHH1zL1D
Cleaning up project directory and file based variables
ERROR: Job failed: exit code 1

failed
build-no-threads-no-slapd Build
/usr/bin/ld:../../libraries/liblber/liblber.vers:9: syntax error in VERSION script
collect2: error: ld returned 1 exit status
make[2]: *** [Makefile:395: liblber.la] Error 1
make[2]: Leaving directory '/builds/quanah/openldap/libraries/liblber'
make[1]: Leaving directory '/builds/quanah/openldap/libraries'
make[1]: *** [Makefile:312: all-common] Error 1
make: *** [Makefile:320: all-common] Error 1
Cleaning up project directory and file based variables
ERROR: Job failed: exit code 1