ITS#9400 Added test case for back-ldap retry failure

3 jobs for ldap-back-retry-fail in 9 minutes and 55 seconds (queued for 1 second)
latest
Status Job ID Name Coverage
  Build
failed #2758
build-gnutls-mit-standalone-lloadd

00:09:45

passed #2756
build-no-threads-no-slapd

00:02:36

failed #2757
build-openssl-heimdal-lloadd

00:09:55

 
Name Stage Failure
failed
build-openssl-heimdal-lloadd Build
make[1]: *** [Makefile:284: test] Error 2
make[1]: Leaving directory '/builds/tsaarni/openldap/tests'
make: *** [Makefile:296: test] Error 2
Uploading artifacts for failed job
Uploading artifacts...
tests/testrun/: found 20 matching files and directories

Uploading artifacts as "archive" to coordinator... ok
id=2757 responseStatus=201 Created token=21wx_F6b
Cleaning up file based variables
ERROR: Job failed: exit code 1
failed
build-gnutls-mit-standalone-lloadd Build
make[1]: *** [Makefile:284: test] Error 2
make[1]: Leaving directory '/builds/tsaarni/openldap/tests'
make: *** [Makefile:296: test] Error 2
Uploading artifacts for failed job
Uploading artifacts...
tests/testrun/: found 20 matching files and directories

Uploading artifacts as "archive" to coordinator... ok
id=2758 responseStatus=201 Created token=S7v5Y7zZ
Cleaning up file based variables
ERROR: Job failed: exit code 1